{"text_format":"1","workbook":"xlsx","n_sheets":9,"sheets":["Sheet1","Guidance Notes","SD502 Guidelines","Enrolment Form","Pay Scales","Subjectives","Acute Services","Executive Services","Primary Community & Men Health"],"not_rendered":{"charts":0,"images":1,"macros":1,"external_links":5,"defined_names":136,"comments":1,"pivot_tables":0},"unopened":[],"bounds":{"document_bytes":16777216,"sheet_cells":100000,"rows_first":2000,"rows_last":500,"rows_between":2000,"halvings":0,"cell_chars":16384,"cell_head_chars":4096},"cells_cut":0,"cells_raw":0,"read":"whole","date_system":"1900"}

{"sheet":"Sheet1","index":0,"n_rows":231,"n_cols":95,"rows_kept":231,"cut":false,"hidden":true,"merged":[[56,24,56,25],[57,24,57,25],[52,24,52,25],[53,24,53,25],[54,24,54,25],[55,24,55,25]]}
["Payscale","Payscale Description","Payscale_Description",null,"Subjective Meaning","Subjective Code",null,"Cost Centre","CC_Cost Centre",null,"Cost Centre","Department",null,"Department","Clinical Directorate",null,"Clinical Directorate","Division",null,"Title","Marital Status","Gender","Yes_No",null,"Ethnic_Origin",null,"Registration_Body",null,"Qualification",null,"Contract",null,"FT_PT",null,"Disabled",null,null,null,null,"Grade_AFC_Band",null,null,null,null,null,null,null,null,null,null,null,null,null,null,null,null,null,null,null,null,null,null,"Estab_Reasons","Ethnic_Origin",null,null,null,null,null,null,null,null,null,null,null,null,null,null,null,null,null,null,null,null,null,null,null,null,null,null,null,null,"Nationality","Recruitment Source","Other_Payscale"]
[".",".",".",null,".",".",null,".",".",null,".",".",null,".",".",null,".",".",null,"Brother","Civil Partnership","Male","Yes",null,"Any Other Ethnic Group",null,"ACCA|Full Membership",null,"A Level",null,"Fixed term",null,"Full time",null,"Learning disability/difficulty",null,"Full",null,null,"Other Payscale (Please select below)",null,null,null,null,null,null,null,null,null,null,"January","DISMISSAL","END OF FIXED TERM CONTRACT","RETIREMENT","REDUNDANCY","VOLUNTARY RESIGNATION","OTHER","DESTINATION ON LEAVING","Yes","SICK PAY","January","NMC_Part","Budgeting adjustments/cost centre reallocation","Any_Other_Ethnic_Group","Any Other Ethnic Group",null,null,null,null,null,null,null,null,null,null,null,null,null,null,null,null,null,null,null,null,null,null,null,null,null,null,null,"Afghan","NHS Organisation","."]
["CHOO","Chief Operating Officer","CHOO Chief Operating Officer",null,"Chair","20000",null,"1011","001 Miscellaneous Executive Recharges",null,"1011","001 Miscellaneous Executive Recharges",null,"001 Miscellaneous Executive Recharges","001 Director of Governance",null,"001 Director of Governance","001 Corporate Executives",null,"Canon","Divorced","Female","No",null,"Asian",null,"British Psychological Society",null,"A/S Level",null,"Permanent",null,"Part time",null,"Long-standing illness",null,"Temporary",null,"Band 1","Non_Review_Body_Band_1","£14,581   XN01-01","£14,947   XN01-02","£15,314   XN01-03",null,null,null,null,null,null,null,"February","Capability","End of Fixed term Contract","Retirement Age","Redundancy - Compulsory","Adult Dependants","Pregnancy","NHS Organisation * (see below)","No","Half-Pay",null,"Midwives (RM)","Corrections to ESR figures","Asian_or_Asian_British","Indian","Pakistani","Bangladeshi","Any Other Asian Background",null,null,null,null,null,null,null,null,null,null,null,null,null,null,null,null,null,null,null,null,null,null,null,null,"Albanian","Social Services","Local GPOOH MOOH"]
["LASM","001 Asylum Seeker MS","LASM 001 Asylum Seeker MS",null,"Chief Executive","20200",null,"1035","001 Medical Executive",null,"1035","001 Medical Executive",null,"001 Medical Executive","001 Medical Director",null,"001 Medical Director","001 Corporate Executives",null,"Dame","Legally Seperated",null,null,null,"Black",null,"CIMA|ACMA (Associate Membership)",null,"Bachelors Degree",null,"Temporary",null,"Flexible",null,"Mental Health Condition",null,"Limited",null,"Band 2","Non_Review_Body_Band_2","£14,581   XN02-01","£14,947   XN02-02","£15,314   XN02-03","£15,742   XN02-04","£16,170   XN02-05","£16,598   XN02-06","£17,149   XN02-07","£17,776   XN02-08",null,null,"March","Conduct","Completion of Training Scheme","Retirement Ill Health","Redundancy - Voluntary","Child Dependants","Death in Service","Social Services",null,"No-Pay",null,"Specialist Community Public Health Nursing (FHN)","CRP","Asian","Mixed","Punjabi","Kashmini","East African","Sri Lankan","Tamil","Sinhalese","British","Caribbean","Unspecified",null,null,null,null,null,null,null,null,null,null,null,null,null,null,null,null,null,null,"Algerian","Private Health/Social Care","Local Salaried GP LPGP"]
["LD01","Salaried Primary Dentist - Scale A","LD01 Salaried Primary Dentist - Scale A",null,"Executive Director","20300",null,"1044","001 Clinical Research Facility",null,"1044","001 Clinical Research Facility",null,"001 Clinical Research Facility","001 Medical Director",null,"001 Medical Director","001 Corporate Executives",null,"Dr","Married",null,null,null,"Chinese",null,"CIMA|FCMA (Fellow Membership)",null,"Bachelors Degree Hons",null,"Locum",null,null,null,"No",null,"Provisional",null,"Band 3","Non_Review_Body_Band_3","£16,598   XN03-06","£17,149   XN03-07","£17,776   XN03-08","£18,152   XN03-09","£18,653   XN03-10","£19,217   XN03-11","£19,655   XN03-12",null,null,null,"April","Some Other Substantial Reason","External Rotation","Retirement Early Voluntary",null,"Better Rewards Package","Employee Transfer","Private Health / Social Care",null,"Not applicable",null,"Specialist Community Health Nursing (HV)","Disestablishment of vacant posts/hours","Black_or_Black_British","Caribbean","African","Any Other Balck Background",null,null,null,null,null,null,null,null,null,null,null,null,null,null,null,null,null,null,null,null,null,null,null,null,null,"American","General Practice","Salaried Primary Dentist - Scale A LD01"]
["LD11","Salaried Primary Dentist - Scale B","LD11 Salaried Primary Dentist - Scale B",null,"F1 foundation year 1 (M&D)","24400",null,"1286","001 Safeguarding",null,"1286","001 Safeguarding",null,"001 Safeguarding","001 Director of Nursing",null,"001 Director of Nursing","001 Corporate Executives",null,"Father","Single",null,null,null,"Filipino",null,"CIMA|Passed Finalist",null,"Certificate",null,null,null,null,null,"Not Declared",null,null,null,"Band 4","Non_Review_Body_Band_4","£19,217   XN04-11","£19,655   XN04-12","£20,348   XN04-13","£21,052   XN04-14","£21,692   XN04-15","£21,909   XN04-16","£22,458   XN04-17",null,null,null,"May","Statutory Reason","End of Work Requirement","No Actuarial reduction",null,"Lack of Opportunities","Initial Pension Ended","General practice",null,null,null,"Specialist Community Public Health Nursing (OH)","End of project/service","Black","Somali","Mixed","Nigerian","British","Unspecified",null,null,null,null,null,null,null,null,null,null,null,null,null,null,null,null,null,null,null,null,null,null,null,"American Samoan","Prison Service","Salaried Primary Dentist - Scale B LD11"]
["LD21","Salaried Primary Dentist - Scale C","LD21 Salaried Primary Dentist - Scale C",null,"F2 foundation year 2 (M&D)","24100",null,"1376","001 Occupational Health UHW",null,"1376","001 Occupational Health UHW",null,"001 Occupational Health UHW","001 Director of Workforce & Organisational Development",null,"001 Director of Workforce & Organisational Development","001 Corporate Executives",null,"Lady","Unknown",null,null,null,"Japanese",null,"CIMA|Student",null,"Certificate in Secondary Education (CSE)",null,null,null,null,null,"Other",null,null,null,"Band 5","Non_Review_Body_Band_5","£21,909   XN05-16","£22,458   XN05-17","£23,362   XN05-18","£24,304   XN05-19","£25,298   XN05-20","£26,302  XN05-21","£27,361   XN05-22","£28,462   XN05-23",null,null,"June",null,"Other","With Actuarial reduction",null,"Health","Merged Organisation Duplicate Record","Prison Service",null,null,null,"Specialist Community Public Health Nursing (RPHN)","Funding Ceased","Chinese","Chinese",null,null,null,null,null,null,null,null,null,null,null,null,null,null,null,null,null,null,null,null,null,null,null,null,null,null,null,"Andorran","Armed Forces","Salaried Primary Dentist - Scale C LD21"]
["LPG3","Dental Advisor","LPG3 Dental Advisor",null,"G.P.Sessions / Staff Fund","25300",null,"1640","001 Director Of Public Health",null,"1640","001 Director Of Public Health",null,"001 Director Of Public Health","001 Director of Public Health",null,"001 Director of Public Health","001 Corporate Executives",null,"Lord","Widowed",null,null,null,"Malaysian",null,"CIPD|Associate Member",null,"Cert. of Completion of Specialist Training",null,null,null,null,null,"Physical Impairment",null,null,null,"Band 6","Non_Review_Body_Band_6","£26,302   XN06-21","£27,361   XN06-22","£28,462   XN06-23","£29,333   XN06-24","£30,357   XN06-25","£31,383   XN06-26","£32,407   XN06-27","£33,560   XN06-28","£35,225   XN06-29",null,"July",null,null,null,null,"Incompatible Working Relations","Mutually Agreed Resignation - Local Scheme with Repayment","Education Sector",null,null,null,"Specialist Community Public Health Nursing (SN)","New posts","Filipino","Filipino",null,null,null,null,null,null,null,null,null,null,null,null,null,null,null,null,null,null,null,null,null,null,null,null,null,null,null,"Angolan","Education Sector","Senior House Officer - Sessional (Medical) MN22"]
["LPGP","Local Salaried GP","LPGP Local Salaried GP",null,"Locum Associate Specialist (M&D)","22200",null,"1700","001 Director of Transformation",null,"1700","001 Director of Transformation",null,"001 Director of Transformation","001 Director Of Transformation",null,"001 Director Of Transformation","001 Corporate Executives",null,"Major",null,null,null,null,"Mixed",null,"CIPD|Companion",null,"Diploma",null,null,null,null,null,"Sensory Impairment",null,null,null,"Band 7","Non_Review_Body_Band_7","£31,383   XN07-26","£32,407   XN07-27","£33,560   XN07-28","£35,225   XN07-29","£36,250   XN07-30","£37,403   XN07-31","£38,683   XN07-32","£40,028   XN07-33","£41,373  XN07-34",null,"August",null,null,null,null,"Promotion",null,"Other Public Sector",null,null,null,"Sub-Part 1 RNA (Adult)","New/additional funding - external","Japanese","Japanese",null,null,null,null,null,null,null,null,null,null,null,null,null,null,null,null,null,null,null,null,null,null,null,null,null,null,null,"Angillan","Other Public Sector","Senior House Officer (Medical) MN21"]
["LVDP","Vocational Dental Practitioner","LVDP Vocational Dental Practitioner",null,"Locum Clinical Asst (M&D)","25200",null,"2502","001 Nephrology Medical Staff",null,"2502","001 Nephrology Medical Staff",null,"001 Nephrology Medical Staff","001 Nephrology",null,"001 Nephrology","001 Specialist Services Clinical Board",null,"Miss",null,null,null,null,"Not Stated",null,"CIPD|Fellow",null,"English National Board (ENB)",null,null,null,null,null,"Yes - Unspecified",null,null,null,"Band 8A","Non_Review_Body_Band_8A","£40,028   XN08-33","£41,373   XN08-34","£43,038   XN08-35","£44,703   XN08-36","£46,625   XN08-37","£48,034   XN08-38",null,null,null,null,"September",null,null,null,null,"Relocation",null,"Other private Sector",null,null,null,"Sub-Part 1 RNC (Children)","New/additional funding - internal","Malaysian","Malaysian",null,null,null,null,null,null,null,null,null,null,null,null,null,null,null,null,null,null,null,null,null,null,null,null,null,null,null,"Antiguan","Other Private Sector","Specialist Registrar - Sessional (Medical) MN26"]
{"$rows_left_out":222}
{"sheet":"Guidance Notes","index":1,"n_rows":8,"n_cols":2,"rows_kept":8,"cut":false,"hidden":false,"merged":[[0,0,0,1]]}
["General Guidance Notes"]
["Instructions:"]
["Step 1.","You should complete this form on screen, typing data into the relevant cell or using the shaded drop down list where indicated."]
["Step 2.","When completed, save the file onto to your PC using the \"File... Save as\" option."]
[null,"Ensure that you save the form in an appropriate location, for example your H: Drive - you MUST NOT save to the 'C:' drive, My Documents or your Desktop."]
["Step 3.","Print the form and sign / authorise as necessary."]
["Step 4.","Send the completed, signed form to the Department(s) as indicated at the bottom of the form."]
["Step 5.","Print a copy of the form and place it on the Personal file."]

{"sheet":"SD502 Guidelines","index":2,"n_rows":10,"n_cols":2,"rows_kept":10,"cut":false,"hidden":false,"merged":[[0,0,0,1]]}
["SD502 Pension Guidance Notes"]
[]
[null,"The SD502 form has changed. Please read the following instructions if the employee wishes to opt out of the Pension Scheme."]
[]
["●","The new version is now 4 pages long and we are no longer allowed to issue this form to anyone i.e. Employees, Managers, Departments, Recruitment, Bank Office or HR."]
["●","Please do not issue any SD502s in the future."]
["●","The individual must obtain Form SD502 themselves by either downloading it from the website:"]
[null,"www.nhsbsa.nhs.uk/pensions"]
[null,"Or:"]
[null,"If they are unable to download and print a copy of the form, the individual can request one is sent to them by calling the Member Helpline on 0300 330 1346"]
{"$rows_left_out":1}
{"sheet":"Enrolment Form","index":3,"n_rows":139,"n_cols":9,"rows_kept":139,"cut":false,"hidden":false,"merged":[[118,5,118,7],[123,0,123,7],[120,1,120,2],[110,2,110,4],[97,0,97,4],[95,0,95,4],[95,6,95,7],[105,1,105,7],[138,0,138,7],[137,0,137,7],[136,0,136,7],[103,0,103,4],[117,4,117,6],[121,1,121,2],[117,2,117,3],[117,0,117,1],[116,2,116,5],[116,0,116,1],[103,5,103,7],[101,0,101,4],[134,1,134,3],[130,2,130,4],[128,0,128,1],[128,2,128,4],[65,0,65,1],[63,2,63,5],[64,2,64,5],[77,3,77,6],[90,0,90,7],[62,2,62,5],[65,2,65,5],[63,0,63,1],[64,0,64,1],[88,1,88,7],[62,0,62,1],[66,0,66,1],[73,1,73,3],[74,1,74,2],[68,1,68,7],[66,2,66,5],[71,2,71,7],[72,1,72,7],[79,0,79,7],[130,0,130,1],[126,0,126,7],[84,0,84,4],[54,1,54,3],[48,0,48,1],[124,0,124,7],[125,0,125,7],[114,0,114,1],[110,0,110,1],[112,1,112,7],[119,6,119,7],[118,1,118,3],[122,1,122,2],[108,0,108,7],[99,0,99,3],[97,5,97,7],[55,1,55,3],[55,6,55,7],[74,4,74,5],[93,0,93,1],[54,6,54,7],[51,1,51,7],[61,2,61,5],[59,1,59,7],[61,0,61,1],[21,0,21,3],[22,0,22,3],[39,0,39,3],[36,0,36,7],[37,0,37,3],[37,4,37,5],[43,6,43,7],[53,6,53,7],[47,0,47,1],[53,1,53,3],[44,6,44,7],[42,6,42,7],[22,5,22,7],[42,1,42,2],[41,6,41,7],[41,1,41,2],[33,5,33,6],[30,0,30,3],[48,4,48,5],[48,6,48,7],[47,4,47,5],[43,1,43,2],[45,1,45,2],[45,6,45,7],[56,1,56,3],[31,0,31,3],[26,1,26,7],[32,0,32,3],[23,0,23,3],[24,5,24,7],[28,1,28,3],[28,5,28,7],[29,1,29,3],[24,1,24,2],[30,5,30,6],[44,1,44,2],[33,1,33,2],[35,1,35,7],[39,5,39,6],[47,6,47,7],[0,0,0,7],[20,5,20,7],[4,5,4,7],[17,1,17,3],[20,1,20,3],[18,5,18,7],[2,0,2,7],[8,0,8,7],[14,1,14,3],[3,0,3,7],[12,1,12,7],[14,5,14,7],[15,5,15,7],[16,5,16,7],[9,3,9,7],[10,0,10,7],[7,0,7,7],[9,0,9,1],[16,1,16,3],[6,1,6,3],[6,5,6,7],[92,0,92,7],[75,4,75,6],[75,0,75,3],[82,5,82,7],[74,6,74,7],[73,4,73,6],[81,0,82,4],[78,3,78,6],[86,0,86,4],[85,0,85,4]]}
[]
[]
["MEDICAL & DENTAL ENROLMENT FORM ONLY ALL OTHER GRADES TO USE TRAC"]
[]
["COST CENTRE*",".",null,null,"DIRECTORATE",{"$f":"VLOOKUP(B7,Sheet1!$N$2:$O$713,2,FALSE)","v":"."}]
[]
["DEPARTMENT",{"$f":"VLOOKUP(B5,Sheet1!$H$2:$I$713,2,FALSE)","v":"."},null,null,"DIVISION",{"$f":"VLOOKUP(F5,Sheet1!$Q$2:$R$713,2,FALSE)","v":"."}]
[]
["The fields marked with an asterisk (*) denote a mandatory field which must be completed."]
["When you click in a Cell shaded ",null,null,"   a Drop down list a appears allowing you to pick the appropriate data item."]
{"$rows_left_out":130}
{"sheet":"Pay Scales","index":4,"n_rows":39,"n_cols":5,"rows_kept":39,"cut":false,"hidden":false,"merged":[]}
[null,null,"Payscale","Payscale Description","Contract"]
["Non Review Body pay scales cover Admin,",null,"LD01","Salaried Primary Dentist - Scale A","Medical"]
["Ancillary, Estates Staff (and Senior Managers",null,"LD11","Salaried Primary Dentist - Scale B","Medical"]
["on Band 7 and below)",null,"LD21","Salaried Primary Dentist - Scale C","Medical"]
[null,null,"LPGP","Local Salaried GP","Medical"]
[null,null,"MC01","Associate Specialist","Medical"]
[null,null,"MC02","Associate Specialist - Disc Pnts","Medical"]
[null,null,"MC41","Associate Specialist New Contract","Medical"]
[null,null,"MC42","Associate Specialist - Locum","Medical"]
[null,null,"MC46","Specialty Doctor","Medical"]
{"$rows_left_out":30}
{"sheet":"Subjectives","index":5,"n_rows":23,"n_cols":8,"rows_kept":23,"cut":false,"hidden":false,"merged":[]}
[null,"Subjective Meaning","Subjective Code","Contract ",null,"Subjective Meaning","Subjective Code","Contract "]
[null,"Associate Specialist (M&D)","22110","Medical",null,"Chair","20000","Other"]
[null,"Clinical Assistant (M&D) ","25000","Medical",null,"Chief Executive","20200","Other"]
[null,"Consultant (M&D)","21000","Medical",null,"Executive Director","20300","Other"]
[null,"Dental Officer",22270,"Medical",null,"Non-Executive Member","20100","Other"]
[null,"Dental Trainees in Hosp Post","24900","Medical",null,"Other Board level Director","20400","Other"]
[null,"F1 foundation year 1 (M&D)","24400","Medical",null,"Vice Chair","20005","Other"]
[null,"F2 foundation year 2 (M&D)","24100","Medical"]
[null,"G.P.Sessions / Staff Fund","25300","Medical"]
[null,"Locum Associate Specialist (M&D)","22200","Medical"]
{"$rows_left_out":14}
{"sheet":"Acute Services","index":6,"n_rows":80,"n_cols":15,"rows_kept":80,"cut":false,"hidden":true,"merged":[[0,0,0,2],[0,4,0,6],[0,8,0,10],[0,12,0,14]]}
["Clinical Diagnostics & Therapeutics Clinical Board",null,null,null,"Medicine Clinical Board",null,null,null,"Specialist Services Clinical Board",null,null,null,"Surgical Services Clinical Board"]
["Directorate","Department","Cost Centre",null,"Directorate","Department","Cost Centre",null,"Directorate","Department","Cost Centre",null,"Directorate","Department","Cost Centre"]
["001 Diagnostics & Therapeutics Mgt","001 Clinical Board Director - Diagnostics & Therapeutics","6180",null,"001 Clinical Gerontology Directorate","001 A6 Stroke Unit","4234",null,"001 ALAS","001 ALAS AR","2703",null,"001 Anaesthetics, Theatres, SSSU Day Surgery & Sterilisation Services","001 Acute Pain","3510"]
["001 Laboratory Medicine & Toxicology Laboratory","001 Biochemistry","6290",null,null,"001 Barry Medical Staff (GP)","4273",null,null,"001 ALAS Clinical Team","2701",null,null,"001 Anaesthetics Llandough","3405"]
[null,"001 Cellular Pathology","6300",null,null,"001 Clinical Gerontology Medical Secretaries","4177",null,null,"001 ALAS Rookwood","2700",null,null,"001 Anaesthetics Support Staff","3500"]
[null,"001 Genetics","6965",null,null,"001 Clinical Gerontology Medical Staffing","4176",null,null,"001 Communication Aids","2710",null,null,"001 Anaesthetics UHW","3370"]
[null,"001 Haematology Administration","6265",null,null,"001 Early Supported Discharge","4289",null,null,"001 Orthotics","2740",null,null,"001 Cardiac Theatres","3375"]
[null,"001 Laboratory Medicine IT","6276",null,null,"001 East 6","4236",null,null,"001 Rehab Engineering (ALAS)","2745",null,null,"001 Day Case Unit Llandough","3410"]
[null,"001 Pathology","6275",null,null,"001 East 7","4237",null,null,"001 Rookwood Environmental Control","2707",null,null,"001 Directorate Support Llandough","3390"]
[null,"001 Pathology Specimen Reception","6277",null,null,"001 East 8","4238",null,null,"001 Rookwood Limbs","2708",null,null,"001 DSU Pre Assessment","3411"]
{"$rows_left_out":71}
{"sheet":"Executive Services","index":7,"n_rows":49,"n_cols":11,"rows_kept":49,"cut":false,"hidden":true,"merged":[[34,4,34,6],[38,0,38,2],[0,0,0,2],[0,4,0,6],[0,8,0,10],[14,0,14,2],[19,0,19,2],[19,4,19,6],[28,0,28,2]]}
["Finance Division",null,null,null,"Nursing Division",null,null,null,"Planning Division"]
["Directorate","Department","Cost Centre",null,"Directorate","Department","Cost Centre",null,"Directorate","Department","Cost Centre"]
["001 Financial Control","001 Cashiers","1125",null,"001 Corporate Nursing Directorate","001 Bereavement","1206",null,"001 Capital and Service Planning","001 Asset Management","1400"]
[null,"001 Clinical Boards Finance Teams","1106",null,null,"001 Carers Strategy Measures","1205",null,null,"001 Capital Planning and Admin","1410"]
[null,"001 Corporate Finance","1105",null,null,"001 Chaplains UHW","1220",null,null,"001 Design Office","1404"]
[null,"001 Counterfraud","1100",null,null,"001 Clinical Teachers","1275",null,null,"001 Health and Safety Department","1009"]
[null,"001 Executives Management","1140",null,null,"001 Concerns Dept","1225",null,null,"001 Partnerships Dept","1440"]
[null,"001 Finance Secondments","1135",null,null,"001 Corporate Nursing","1271",null,null,"001 Programme Management","1402"]
[null,"001 Financial Accounts","1110",null,null,"001 E-Datix","1207",null,null,"001 South Wales Collaborative","1401"]
[null,"001 Financial Services","1115",null,null,"001 Improvement & Clinical Audit Team","1291",null,null,"001 Strategic Communications OSM","1095"]
{"$rows_left_out":40}
{"sheet":"Primary Community & Men Health","index":8,"n_rows":126,"n_cols":11,"rows_kept":126,"cut":false,"hidden":true,"merged":[[0,0,0,2],[0,4,0,6],[0,8,0,10],[44,4,44,6],[50,4,50,6]]}
["Children & Women Clinical Board",null,null,null,"Dental Services Clinical Board",null,null,null,"Menatl Health Clinical Board"]
["Directorate","Department","Cost Centre",null,"Directorate","Department","Cost Centre",null,"Directorate","Department","Cost Centre"]
["001 Acute Child Health Services","001 Acute Admin",5220,null,"001 Community Dental","001 Bro Taf Emergy Dent Serv","8430",null,"001 Adult Services","001 Adfer Ward (W4a)","7340"]
[null,"001 Rhino Grant",5222,null,null,"001 CDS Central Admin","8440",null,null,"001 Amy Evans Centre","7140"]
[null,"001 Island Ward",5223,null,null,"001 CDS Mobile Dental Clinic","8435",null,null,"001 Assertive Outreach Service","7120"]
[null,"001 Paediatric Clinical Research Facility",5224,null,null,"001 Community Dental North","8450",null,null,"001 BIA/Shine Funding","7561"]
[null,"001 Transitional Care Unit",5226,null,null,"001 Community Dental South","8445",null,null,"001 Borderline Personality Disorders","7035"]
[null,"001 Jungle Ward",5227,null,null,"001 Cwm Taf EDS","8432",null,null,"001 Cardiff Alcohol Team","7335"]
[null,"001 Gwdihw Ward",5230,null,null,"001 Improving Oral Health for Older People in Care Homes","8456",null,null,"001 CAU Needle Exchange","7310"]
[null,"001 Paediatric Neurology Med Staff UHW",5235,null,null,"001 Designed to Smile","8453",null,null,"001 CMHT Psychology","7400"]
{"$rows_left_out":116}